error in downloading pydicom

classic Classic list List threaded Threaded
5 messages Options
Reply | Threaded
Open this post in threaded view
|

error in downloading pydicom

Simone Bnà
Hi,

I am compiling the slicer framework
(tag 4.5.0.1,  ENH: Slicer 4.5.0-1 git-svn-id: http://svn.slicer.org/Slicer4/trunk@24735 3bd1e089-480b-0410-8dfb-8563597acbee)
with VS2013 and I found the following error:

35>  -- downloading...
35>         src='http://pydicom.googlecode.com/files/pydicom-0.9.8.tar.gz'
35>         dst='C:/Devel/Slicer-SuperBuild-Release/python-pydicom-prefix/src/pydicom-0.9.8.tar.gz'
35>         timeout='none'
35>CUSTOMBUILD : error : downloading 'http://pydicom.googlecode.com/files/pydicom-0.9.8.tar.gz' failed
35>    status_code: 22
35>    status_string: "HTTP response code said error"
35>    log:
35>    --- LOG BEGIN ---
35>    timeout on name lookup is not supported
35>    Trying 74.125.133.82...
35>  Connected to pydicom.googlecode.com (74.125.133.82) port 80 (#0)
35>  GET /files/pydicom-0.9.8.tar.gz HTTP/1.1
35>  
35>  Host: pydicom.googlecode.com
35>  
35>  User-Agent: curl/7.50.1
35>  
35>  Accept: */*
35>  
35>  
35>  
35>CUSTOMBUILD : The requested URL returned error : 404 Not Found
35>  Closing connection 0

which generates errors in cascade in other modules.

Is the URL of pydicom changed?

Thanks,

Best regards,

Simone.

--
Simone Bnà, PhD
C++ Software Developer, CINECA
Via Magnanelli 6/3, 40033 Casalecchio di Reno, Italy
office:   +39-0516171938
email: [hidden email]/[hidden email]
_______________________________________________
slicer-users mailing list
[hidden email]
http://massmail.spl.harvard.edu/mailman/listinfo/slicer-users
To unsubscribe: send email to [hidden email] with unsubscribe as the subject
http://www.slicer.org/slicerWiki/index.php/Documentation/4.3/FAQ
Reply | Threaded
Open this post in threaded view
|

Re: error in downloading pydicom

Andras Lasso-2
Google has retired its code repository and changed download URLs. Nightly Slicer builds use a different repository now:
https://pypi.python.org/packages/43/62/ba7218b51ebc231863c321dedef54cf97fb29e33832e67db00951a998c50/pydicom-0.9.8.tar.gz

Update your External_python-pydicom.cmake with the new URL.

Andras

-----Original Message-----
From: slicer-users [mailto:[hidden email]] On Behalf Of Simone Bnà
Sent: September 29, 2016 11:20
To: SPL Slicer Users <[hidden email]>
Subject: [slicer-users] error in downloading pydicom

Hi,

I am compiling the slicer framework
(tag 4.5.0.1,  ENH: Slicer 4.5.0-1 git-svn-id: http://svn.slicer.org/Slicer4/trunk@24735 3bd1e089-480b-0410-8dfb-8563597acbee)
with VS2013 and I found the following error:

35>  -- downloading...
35>         src='http://pydicom.googlecode.com/files/pydicom-0.9.8.tar.gz'
35>         dst='C:/Devel/Slicer-SuperBuild-Release/python-pydicom-prefix/src/pydicom-0.9.8.tar.gz'
35>         timeout='none'
35>CUSTOMBUILD : error : downloading 'http://pydicom.googlecode.com/files/pydicom-0.9.8.tar.gz' failed
35>    status_code: 22
35>    status_string: "HTTP response code said error"
35>    log:
35>    --- LOG BEGIN ---
35>    timeout on name lookup is not supported
35>    Trying 74.125.133.82...
35>  Connected to pydicom.googlecode.com (74.125.133.82) port 80 (#0)
35>  GET /files/pydicom-0.9.8.tar.gz HTTP/1.1
35>  
35>  Host: pydicom.googlecode.com
35>  
35>  User-Agent: curl/7.50.1
35>  
35>  Accept: */*
35>  
35>  
35>  
35>CUSTOMBUILD : The requested URL returned error : 404 Not Found
35>  Closing connection 0

which generates errors in cascade in other modules.

Is the URL of pydicom changed?

Thanks,

Best regards,

Simone.

--
Simone Bnà, PhD
C++ Software Developer, CINECA
Via Magnanelli 6/3, 40033 Casalecchio di Reno, Italy
office:   +39-0516171938
email: [hidden email]/[hidden email] _______________________________________________
slicer-users mailing list
[hidden email]
http://massmail.spl.harvard.edu/mailman/listinfo/slicer-users
To unsubscribe: send email to [hidden email] with unsubscribe as the subject http://www.slicer.org/slicerWiki/index.php/Documentation/4.3/FAQ
_______________________________________________
slicer-users mailing list
[hidden email]
http://massmail.spl.harvard.edu/mailman/listinfo/slicer-users
To unsubscribe: send email to [hidden email] with unsubscribe as the subject
http://www.slicer.org/slicerWiki/index.php/Documentation/4.3/FAQ
Reply | Threaded
Open this post in threaded view
|

Re: error in downloading pydicom

Simone Bnà
In reply to this post by Simone Bnà
Thanks,

Simone.

----- Messaggio originale -----
Da: "Andras Lasso" <[hidden email]>
A: "Simone Bnà" <[hidden email]>, "SPL Slicer Users" <[hidden email]>
Inviato: Giovedì, 29 settembre 2016 23:11:17
Oggetto: RE: error in downloading pydicom

Google has retired its code repository and changed download URLs. Nightly Slicer builds use a different repository now:
https://pypi.python.org/packages/43/62/ba7218b51ebc231863c321dedef54cf97fb29e33832e67db00951a998c50/pydicom-0.9.8.tar.gz

Update your External_python-pydicom.cmake with the new URL.

Andras

-----Original Message-----
From: slicer-users [mailto:[hidden email]] On Behalf Of Simone Bnà
Sent: September 29, 2016 11:20
To: SPL Slicer Users <[hidden email]>
Subject: [slicer-users] error in downloading pydicom

Hi,

I am compiling the slicer framework
(tag 4.5.0.1,  ENH: Slicer 4.5.0-1 git-svn-id: http://svn.slicer.org/Slicer4/trunk@24735 3bd1e089-480b-0410-8dfb-8563597acbee)
with VS2013 and I found the following error:

35>  -- downloading...
35>         src='http://pydicom.googlecode.com/files/pydicom-0.9.8.tar.gz'
35>         dst='C:/Devel/Slicer-SuperBuild-Release/python-pydicom-prefix/src/pydicom-0.9.8.tar.gz'
35>         timeout='none'
35>CUSTOMBUILD : error : downloading 'http://pydicom.googlecode.com/files/pydicom-0.9.8.tar.gz' failed
35>    status_code: 22
35>    status_string: "HTTP response code said error"
35>    log:
35>    --- LOG BEGIN ---
35>    timeout on name lookup is not supported
35>    Trying 74.125.133.82...
35>  Connected to pydicom.googlecode.com (74.125.133.82) port 80 (#0)
35>  GET /files/pydicom-0.9.8.tar.gz HTTP/1.1
35>  
35>  Host: pydicom.googlecode.com
35>  
35>  User-Agent: curl/7.50.1
35>  
35>  Accept: */*
35>  
35>  
35>  
35>CUSTOMBUILD : The requested URL returned error : 404 Not Found
35>  Closing connection 0

which generates errors in cascade in other modules.

Is the URL of pydicom changed?

Thanks,

Best regards,

Simone.

--
Simone Bnà, PhD
C++ Software Developer, CINECA
Via Magnanelli 6/3, 40033 Casalecchio di Reno, Italy
office:   +39-0516171938
email: [hidden email]/[hidden email] _______________________________________________
slicer-users mailing list
[hidden email]
http://massmail.spl.harvard.edu/mailman/listinfo/slicer-users
To unsubscribe: send email to [hidden email] with unsubscribe as the subject http://www.slicer.org/slicerWiki/index.php/Documentation/4.3/FAQ

--
Simone Bnà, PhD
C++ Software Developer, CINECA
Via Magnanelli 6/3, 40033 Casalecchio di Reno, Italy
office:   +39-0516171938
email: [hidden email]/[hidden email]
_______________________________________________
slicer-users mailing list
[hidden email]
http://massmail.spl.harvard.edu/mailman/listinfo/slicer-users
To unsubscribe: send email to [hidden email] with unsubscribe as the subject
http://www.slicer.org/slicerWiki/index.php/Documentation/4.3/FAQ
Reply | Threaded
Open this post in threaded view
|

Re: error in downloading pydicom

Simone Bnà
Dear Andras,

I updated the URL and URL_MD5 of pydicom and it works ok.

Now, I have an error in the CTK build.

The error is :

IOError: [Errno 2] No such file or directory: 'C:/Devel/Slicer-SuperBuil-Release/CTK/Libs/Widgets/ctkMenuComboBoxEventPlayer.h'

Below you find the logs of the CTK build.

I tried to delete the build, re run cmake and re build with VS but I found the same error.

Do you have any idea?

Best,

Simone.


----------


12>         Creating library C:/Devel/Slicer-SuperBuild-Release/CTK-build/CTK-build/bin/Release/CTKWidgetsPlugins.lib and object C:/Devel/Slicer-SuperBuild-Release/CTK-build/CTK-build/bin/Release/CTKWidgetsPlugins.exp
12>      CTKWidgetsPlugins.vcxproj -> C:\Devel\Slicer-SuperBuild-Release\CTK-build\CTK-build\bin\designer\Release\CTKWidgetsPlugins.dll
12>    PostBuildEvent:
12>      setlocal
12>      "C:\Program Files\CMake\bin\cmake.exe" -E copy C:/Devel/Slicer-SuperBuild-Release/CTK-build/CTK-build/bin/designer/Release/CTKWidgetsPlugins.dll C:/Devel/Slicer-SuperBuild-Release/CTK-build/CTK-build/bin/designer/../designer/CTKWidgetsPlugins.dll
12>      if %errorlevel% neq 0 goto :cmEnd
12>      :cmEnd
12>      endlocal & call :cmErrorLevel %errorlevel% & goto :cmDone
12>      :cmErrorLevel
12>      exit /b %1
12>      :cmDone
12>      if %errorlevel% neq 0 goto :VCEnd
12>      :VCEnd
12>    FinalizeBuildStatus:
12>      Eliminazione del file "CTKWidgetsPlugins.dir\Release\CTKWidge.E9E1F3E7.tlog\unsuccessfulbuild" in corso.
12>      Aggiornamento timestamp di "CTKWidgetsPlugins.dir\Release\CTKWidge.E9E1F3E7.tlog\CTKWidgetsPlugins.lastbuildstate".
12>    Compilazione progetto "C:\Devel\Slicer-SuperBuild-Release\CTK-build\CTK-build\Libs\Widgets\Plugins\CTKWidgetsPlugins.vcxproj" (destinazioni predefinite) completata.
12>    Compilazione di "C:\Devel\Slicer-SuperBuild-Release\CTK-build\CTK-build\Libs\Widgets\CTKWidgetsPythonQt.vcxproj" (25) dal progetto "C:\Devel\Slicer-SuperBuild-Release\CTK-build\CTK-build\ALL_BUILD.vcxproj" (1) sul nodo 1 (destinazioni predefinite).
12>    PrepareForBuild:
12>      Creazione directory "CTKWidgetsPythonQt.dir\Release\".
12>      Creazione directory "CTKWidgetsPythonQt.dir\Release\CTKWidge.F219CE26.tlog\".
12>    InitializeBuildStatus:
12>      Creazione di "CTKWidgetsPythonQt.dir\Release\CTKWidge.F219CE26.tlog\unsuccessfulbuild". È stato specificato "AlwaysCreate".
12>    CustomBuild:
12>      Building Custom Rule C:/Devel/Slicer-SuperBuild-Release/CTK/Libs/Widgets/CMakeLists.txt
12>      CMake does not need to re-run because C:\Devel\Slicer-SuperBuild-Release\CTK-build\CTK-build\Libs\Widgets\CMakeFiles\generate.stamp is up-to-date.
12>      PythonQt Wrapping - Generating generated_cpp/org_commontk_CTKWidgets/org_commontk_CTKWidgets_init.cpp
12>      Traceback (most recent call last):
12>        File "C:/Devel/Slicer-SuperBuild-Release/CTK/CMake/ctkWrapPythonQt.py", line 237, in <module>
12>          ctk_wrap_pythonqt(options.target, options.namespace, options.output_dir, args, options.extra_verbose)
12>        File "C:/Devel/Slicer-SuperBuild-Release/CTK/CMake/ctkWrapPythonQt.py", line 77, in ctk_wrap_pythonqt
12>          with open(input_file) as f:
12>      IOError: [Errno 2] No such file or directory: 'C:/Devel/Slicer-SuperBuil-Release/CTK/Libs/Widgets/ctkMenuComboBoxEventPlayer.h'
12>C:\Program Files (x86)\MSBuild\Microsoft.Cpp\v4.0\V120\Microsoft.CppCommon.targets(170,5): error MSB6006: "cmd.exe" terminato con il codice 1. [C:\Devel\Slicer-SuperBuild-Release\CTK-build\CTK-build\Libs\Widgets\CTKWidgetsPythonQt.vcxproj] [C:\Devel\Slicer-SuperBuild-Release\CTK-build\CTK.vcxproj]
12>    Compilazione progetto "C:\Devel\Slicer-SuperBuild-Release\CTK-build\CTK-build\Libs\Widgets\CTKWidgetsPythonQt.vcxproj" (destinazioni predefinite) NON COMPLETATA.
12>    Compilazione di "C:\Devel\Slicer-SuperBuild-Release\CTK-build\CTK-build\Libs\Scripting\Python\Core\Python\CompileCTKScriptingPythonCorePythonFiles.vcxproj" (26) dal progetto "C:\Devel\Slicer-SuperBuild-Release\CTK-build\CTK-build\ALL_BUILD.vcxproj" (1) sul nodo 1 (destinazioni predefinite).
12>    Compilazione di "C:\Devel\Slicer-SuperBuild-Release\CTK-build\CTK-build\Libs\Scripting\Python\Core\Python\CopyCTKScriptingPythonCorePythonScriptFiles.vcxproj" (27) dal progetto "C:\Devel\Slicer-SuperBuild-Release\CTK-build\CTK-build\Libs\Scripting\Python\Core\Python\CompileCTKScriptingPythonCorePythonFiles.vcxproj" (26) sul nodo 1 (destinazioni predefinite).
12>    PrepareForBuild:
12>      Creazione directory "x64\Release\CopyCTKScriptingPythonCorePythonScriptFiles\".
12>      Creazione directory "x64\Release\CopyCTKScriptingPythonCorePythonScriptFiles\CopyCTKS.FFF3E6F9.tlog\".
12>    InitializeBuildStatus:
12>      Creazione di "x64\Release\CopyCTKScriptingPythonCorePythonScriptFiles\CopyCTKS.FFF3E6F9.tlog\unsuccessfulbuild". È stato specificato "AlwaysCreate".
12>    ComputeCustomBuildOutput:
12>      Creazione directory "C:\Devel\Slicer-SuperBuild-Release\CTK-build\CTK-build\bin\Python\qt\".
12>      Creazione directory "C:\Devel\Slicer-SuperBuild-Release\CTK-build\CTK-build\bin\Python\ctk\".
12>    CustomBuild:
12>      Building Custom Rule C:/Devel/Slicer-SuperBuild-Release/CTK/Libs/Scripting/Python/Core/Python/CMakeLists.txt
12>      CMake does not need to re-run because C:\Devel\Slicer-SuperBuild-Release\CTK-build\CTK-build\Libs\Scripting\Python\Core\Python\CMakeFiles\generate.stamp is up-to-date.
12>      Copying python Script: qt/__init__.py
12>      Copying python Script: ctk/__init__.py
12>    FinalizeBuildStatus:
12>      Eliminazione del file "x64\Release\CopyCTKScriptingPythonCorePythonScriptFiles\CopyCTKS.FFF3E6F9.tlog\unsuccessfulbuild" in corso.
12>      Aggiornamento timestamp di "x64\Release\CopyCTKScriptingPythonCorePythonScriptFiles\CopyCTKS.FFF3E6F9.tlog\CopyCTKScriptingPythonCorePythonScriptFiles.lastbuildstate".
12>    Compilazione progetto "C:\Devel\Slicer-SuperBuild-Release\CTK-build\CTK-build\Libs\Scripting\Python\Core\Python\CopyCTKScriptingPythonCorePythonScriptFiles.vcxproj" (destinazioni predefinite) completata.
12>    PrepareForBuild:
12>      Creazione directory "x64\Release\CompileCTKScriptingPythonCorePythonFiles\".
12>      Creazione directory "x64\Release\CompileCTKScriptingPythonCorePythonFiles\CompileC.4D90A2C9.tlog\".
12>    InitializeBuildStatus:
12>      Creazione di "x64\Release\CompileCTKScriptingPythonCorePythonFiles\CompileC.4D90A2C9.tlog\unsuccessfulbuild". È stato specificato "AlwaysCreate".
12>    CustomBuild:
12>      Building Custom Rule C:/Devel/Slicer-SuperBuild-Release/CTK/Libs/Scripting/Python/Core/Python/CMakeLists.txt
12>      CMake does not need to re-run because C:\Devel\Slicer-SuperBuild-Release\CTK-build\CTK-build\Libs\Scripting\Python\Core\Python\CMakeFiles\generate.stamp is up-to-date.
12>      Compiling python scripts: CTKScriptingPythonCore
12>      Compiling C:/Devel/Slicer-SuperBuild-Release/CTK-build/CTK-build/bin/Python/qt/__init__.py ...
12>      
12>      Compiling C:/Devel/Slicer-SuperBuild-Release/CTK-build/CTK-build/bin/Python/ctk/__init__.py ...
12>      
12>    FinalizeBuildStatus:
12>      Eliminazione del file "x64\Release\CompileCTKScriptingPythonCorePythonFiles\CompileC.4D90A2C9.tlog\unsuccessfulbuild" in corso.
12>      Aggiornamento timestamp di "x64\Release\CompileCTKScriptingPythonCorePythonFiles\CompileC.4D90A2C9.tlog\CompileCTKScriptingPythonCorePythonFiles.lastbuildstate".
12>    Compilazione progetto "C:\Devel\Slicer-SuperBuild-Release\CTK-build\CTK-build\Libs\Scripting\Python\Core\Python\CompileCTKScriptingPythonCorePythonFiles.vcxproj" (destinazioni predefinite) completata.
12>    Compilazione di "C:\Devel\Slicer-SuperBuild-Release\CTK-build\CTK-build\Applications\ctkDICOM\ctkDICOM.vcxproj" (28) dal progetto "C:\Devel\Slicer-SuperBuild-Release\CTK-build\CTK-build\ALL_BUILD.vcxproj" (1) sul nodo 1 (destinazioni predefinite).
12>    PrepareForBuild:
12>      Creazione directory "ctkDICOM.dir\Release\".
12>      Creazione directory "ctkDICOM.dir\Release\ctkDICOM.tlog\".
12>    InitializeBuildStatus:
12>      Creazione di "ctkDICOM.dir\Release\ctkDICOM.tlog\unsuccessfulbuild". È stato specificato "AlwaysCreate".
12>    CustomBuild:
12>      Building Custom Rule C:/Devel/Slicer-SuperBuild-Release/CTK/Applications/ctkDICOM/CMakeLists.txt
12>      CMake does not need to re-run because C:\Devel\Slicer-SuperBuild-Release\CTK-build\CTK-build\Applications\ctkDICOM\CMakeFiles\generate.stamp is up-to-date.
12>    MakeDirsForCl:
12>      Creazione directory "C:\Devel\Slicer-SuperBuild-Release\CTK-build\CTK-build\Applications\ctkDICOM\Release".
12>    ClCompile:
12>      C:\Program Files (x86)\Microsoft Visual Studio 12.0\VC\bin\x86_amd64\CL.exe /c /I"C:\D\Support\qt-4.8.7-64-vs2013-rel\include" /I"C:\D\Support\qt-4.8.7-64-vs2013-rel\include\QtOpenGL" /I"C:\D\Support\qt-4.8.7-64-vs2013-rel\include\QtXmlPatterns" /I"C:\D\Support\qt-4.8.7-64-vs2013-rel\include\QtGui" /I"C:\D\Support\qt-4.8.7-64-vs2013-rel\include\QtXml" /I"C:\D\Support\qt-4.8.7-64-vs2013-rel\include\QtSql" /I"C:\D\Support\qt-4.8.7-64-vs2013-rel\include\QtNetwork" /I"C:\D\Support\qt-4.8.7-64-vs2013-rel\include\QtCore" /I"C:\Devel\Slicer-SuperBuild-Release\CTK\Applications\ctkDICOM" /I"C:\Devel\Slicer-SuperBuild-Release\CTK-build\CTK-build\Applications\ctkDICOM" /I"C:\Devel\Slicer-SuperBuild-Release\CTK-build\CTK-build" /I"C:\Devel\Slicer-SuperBuild-Release\CTK\Libs\DICOM\Widgets" /I"C:\Devel\Slicer-SuperBuild-Release\CTK-build\CTK-build\Libs\DICOM\Widgets" /I"C:\Devel\Slicer-SuperBuild-Release\CTK\Libs\DICOM\Core" /I"C:\Devel\Slicer-SuperBuild-Release\CTK-build\CTK-build\Libs\DICOM\Core" /I"C:\Devel\Slicer-SuperBuild-Release\CTK\Libs\Widgets" /I"C:\Devel\Slicer-SuperBuild-Release\CTK-build\CTK-build\Libs\Widgets" /I"C:\Devel\Slicer-SuperBuild-Release\CTK\Libs\Core" /I"C:\Devel\Slicer-SuperBuild-Release\CTK-build\CTK-build\Libs\Core" /I"C:\Devel\Slicer-SuperBuild-Release\DCMTK-build\config\include\dcmtk\config" /I"C:\Devel\Slicer-SuperBuild-Release\DCMTK\ofstd\include\dcmtk\ofstd" /I"C:\Devel\Slicer-SuperBuild-Release\DCMTK\oflog\include\dcmtk\oflog" /I"C:\Devel\Slicer-SuperBuild-Release\DCMTK\dcmdata\include\dcmtk\dcmdata" /I"C:\Devel\Slicer-SuperBuild-Release\DCMTK\dcmimgle\include\dcmtk\dcmimgle" /I"C:\Devel\Slicer-SuperBuild-Release\DCMTK\dcmimage\include\dcmtk\dcmimage" /I"C:\Devel\Slicer-SuperBuild-Release\DCMTK\dcmjpeg\include\dcmtk\dcmjpeg" /I"C:\Devel\Slicer-SuperBuild-Release\DCMTK\dcmjpls\include\dcmtk\dcmjpls" /I"C:\Devel\Slicer-SuperBuild-Release\DCMTK\dcmtls\include\dcmtk\dcmtls" /I"C:\Devel\Slicer-SuperBuild-Release\DCMTK\dcmnet\include\dcmtk\dcmnet" /I"C:\Devel\Slicer-SuperBuild-Release\DCMTK\dcmsr\include\dcmtk\dcmsr" /I"C:\Devel\Slicer-SuperBuild-Release\DCMTK\dcmsign\include\dcmtk\dcmsign" /I"C:\Devel\Slicer-SuperBuild-Release\DCMTK\dcmwlm\include\dcmtk\dcmwlm" /I"C:\Devel\Slicer-SuperBuild-Release\DCMTK\dcmqrdb\include\dcmtk\dcmqrdb" /I"C:\Devel\Slicer-SuperBuild-Release\DCMTK\dcmpstat\include\dcmtk\dcmpstat" /I"C:\Devel\Slicer-SuperBuild-Release\DCMTK\dcmrt\include\dcmtk\dcmrt" /I"C:\Devel\Slicer-SuperBuild-Release\DCMTK\dcmiod\include\dcmtk\dcmiod" /I"C:\Devel\Slicer-SuperBuild-Release\DCMTK\dcmfg\include\dcmtk\dcmfg" /I"C:\Devel\Slicer-SuperBuild-Release\DCMTK\dcmseg\include\dcmtk\dcmseg" /I"C:\Devel\Slicer-SuperBuild-Release\DCMTK-build\config\include" /I"C:\Devel\Slicer-SuperBuild-Release\DCMTK\ofstd\include" /I"C:\Devel\Slicer-SuperBuild-Release\DCMTK\oflog\include" /I"C:\Devel\Slicer-SuperBuild-Release\DCMTK\dcmdata\include" /I"C:\Devel\Slicer-SuperBuild-Release\DCMTK\dcmimgle\include" /I"C:\Devel\Slicer-SuperBuild-Release\DCMTK\dcmimage\include" /I"C:\Devel\Slicer-SuperBuild-Release\DCMTK\dcmjpeg\include" /I"C:\Devel\Slicer-SuperBuild-Release\DCMTK\dcmjpls\include" /I"C:\Devel\Slicer-SuperBuild-Release\DCMTK\dcmtls\include" /I"C:\Devel\Slicer-SuperBuild-Release\DCMTK\dcmnet\include" /I"C:\Devel\Slicer-SuperBuild-Release\DCMTK\dcmsr\include" /I"C:\Devel\Slicer-SuperBuild-Release\DCMTK\dcmsign\include" /I"C:\Devel\Slicer-SuperBuild-Release\DCMTK\dcmwlm\include" /I"C:\Devel\Slicer-SuperBuild-Release\DCMTK\dcmqrdb\include" /I"C:\Devel\Slicer-SuperBuild-Release\DCMTK\dcmpstat\include" /I"C:\Devel\Slicer-SuperBuild-Release\DCMTK\dcmrt\include" /I"C:\Devel\Slicer-SuperBuild-Release\DCMTK\dcmiod\include" /I"C:\Devel\Slicer-SuperBuild-Release\DCMTK\dcmfg\include" /I"C:\Devel\Slicer-SuperBuild-Release\DCMTK\dcmseg\include" /nologo /W3 /WX- /O2 /Ob2 /D WIN32 /D _WINDOWS /D NOMINMAX /D NDEBUG /D QT_DLL /D QT_NO_DEBUG /D QT_OPENGL_LIB /D QT_XMLPATTERNS_LIB /D QT_GUI_LIB /D QT_XML_LIB /D QT_SQL_LIB /D QT_NETWORK_LIB /D QT_CORE_LIB /D PYTHONQT_USE_RELEASE_PYTHON_FALLBACK /D "CMAKE_INTDIR=\"Release\"" /D _MBCS /Gm- /EHsc /MD /GS /fp:precise /Zc:wchar_t /Zc:forScope /GR /Fo"ctkDICOM.dir\Release\\" /Fd"ctkDICOM.dir\Release\vc120.pdb" /Gd /TP /wd4290 /errorReport:queue "C:\Devel\Slicer-SuperBuild-Release\CTK\Applications\ctkDICOM\ctkDICOMMain.cpp"
12>      ctkDICOMMain.cpp
12>    Link:
12>      C:\Program Files (x86)\Microsoft Visual Studio 12.0\VC\bin\x86_amd64\link.exe /ERRORREPORT:QUEUE /OUT:"C:\Devel\Slicer-SuperBuild-Release\CTK-build\CTK-build\bin\Release\ctkDICOM.exe" /INCREMENTAL:NO /NOLOGO kernel32.lib user32.lib gdi32.lib winspool.lib shell32.lib ole32.lib oleaut32.lib uuid.lib comdlg32.lib advapi32.lib ..\..\bin\Release\CTKDICOMWidgets.lib ..\..\bin\Release\CTKDICOMCore.lib "C:\Devel\Slicer-SuperBuild-Release\DCMTK-build\lib\Release\i2d.lib" "C:\Devel\Slicer-SuperBuild-Release\DCMTK-build\lib\Release\dcmjpeg.lib" "C:\Devel\Slicer-SuperBuild-Release\DCMTK-build\lib\Release\ijg8.lib" "C:\Devel\Slicer-SuperBuild-Release\DCMTK-build\lib\Release\ijg12.lib" "C:\Devel\Slicer-SuperBuild-Release\DCMTK-build\lib\Release\ijg16.lib" "C:\Devel\Slicer-SuperBuild-Release\DCMTK-build\lib\Release\dcmjpls.lib" "C:\Devel\Slicer-SuperBuild-Release\DCMTK-build\lib\Release\charls.lib" "C:\Devel\Slicer-SuperBuild-Release\DCMTK-build\lib\Release\cmr.lib" "C:\Devel\Slicer-SuperBuild-Release\DCMTK-build\lib\Release\dcmwlm.lib" "C:\Devel\Slicer-SuperBuild-Release\DCMTK-build\lib\Release\dcmpstat.lib" "C:\Devel\Slicer-SuperBuild-Release\DCMTK-build\lib\Release\dcmtls.lib" "C:\Devel\Slicer-SuperBuild-Release\DCMTK-build\lib\Release\dcmsr.lib" "C:\Devel\Slicer-SuperBuild-Release\DCMTK-build\lib\Release\dcmimage.lib" "C:\Devel\Slicer-SuperBuild-Release\DCMTK-build\lib\Release\dcmdsig.lib" "C:\Devel\Slicer-SuperBuild-Release\DCMTK-build\lib\Release\dcmqrdb.lib" "C:\Devel\Slicer-SuperBuild-Release\DCMTK-build\lib\Release\dcmnet.lib" "C:\Devel\Slicer-SuperBuild-Release\DCMTK-build\lib\Release\dcmrt.lib" "C:\Devel\Slicer-SuperBuild-Release\DCMTK-build\lib\Release\dcmimgle.lib" "C:\Devel\Slicer-SuperBuild-Release\DCMTK-build\lib\Release\dcmseg.lib" "C:\Devel\Slicer-SuperBuild-Release\DCMTK-build\lib\Release\dcmfg.lib" "C:\Devel\Slicer-SuperBuild-Release\DCMTK-build\lib\Release\dcmiod.lib" "C:\Devel\Slicer-SuperBuild-Release\DCMTK-build\lib\Release\dcmdata.lib" "C:\Devel\Slicer-SuperBuild-Release\DCMTK-build\lib\Release\oflog.lib" "C:\Devel\Slicer-SuperBuild-Release\DCMTK-build\lib\Release\ofstd.lib" ws2_32.lib netapi32.lib wsock32.lib ..\..\bin\Release\CTKWidgets.lib ..\..\bin\Release\CTKCore.lib "C:\D\Support\qt-4.8.7-64-vs2013-rel\lib\QtOpenGL4.lib" "C:\D\Support\qt-4.8.7-64-vs2013-rel\lib\QtXmlPatterns4.lib" "C:\D\Support\qt-4.8.7-64-vs2013-rel\lib\QtXml4.lib" "C:\D\Support\qt-4.8.7-64-vs2013-rel\lib\QtSql4.lib" "C:\D\Support\qt-4.8.7-64-vs2013-rel\lib\QtNetwork4.lib" dbghelp.lib "C:\Devel\Slicer-SuperBuild-Release\CTK-build\QtTesting-build\Release\QtTesting.lib" "C:\D\Support\qt-4.8.7-64-vs2013-rel\lib\QtGui4.lib" "C:\D\Support\qt-4.8.7-64-vs2013-rel\lib\QtCore4.lib" /MANIFEST /MANIFESTUAC:"level='asInvoker' uiAccess='false'" /manifest:embed /PDB:"C:/Devel/Slicer-SuperBuild-Release/CTK-build/CTK-build/bin/Release/ctkDICOM.pdb" /SUBSYSTEM:CONSOLE /TLBID:1 /DYNAMICBASE /NXCOMPAT /IMPLIB:"C:/Devel/Slicer-SuperBuild-Release/CTK-build/CTK-build/bin/Release/ctkDICOM.lib" /MACHINE:X64  /machine:x64 ctkDICOM.dir\Release\ctkDICOMMain.obj
12>      ctkDICOM.vcxproj -> C:\Devel\Slicer-SuperBuild-Release\CTK-build\CTK-build\bin\Release\ctkDICOM.exe
12>    FinalizeBuildStatus:
12>      Eliminazione del file "ctkDICOM.dir\Release\ctkDICOM.tlog\unsuccessfulbuild" in corso.
12>      Aggiornamento timestamp di "ctkDICOM.dir\Release\ctkDICOM.tlog\ctkDICOM.lastbuildstate".
12>    Compilazione progetto "C:\Devel\Slicer-SuperBuild-Release\CTK-build\CTK-build\Applications\ctkDICOM\ctkDICOM.vcxproj" (destinazioni predefinite) completata.
12>    Compilazione progetto "C:\Devel\Slicer-SuperBuild-Release\CTK-build\CTK-build\ALL_BUILD.vcxproj" (destinazioni predefinite) NON COMPLETATA.
12>    
12>    Compilazione NON RIUSCITA.
12>    
12>    "C:\Devel\Slicer-SuperBuild-Release\CTK-build\CTK-build\ALL_BUILD.vcxproj" (destinazione predefinita) (1) ->
12>    "C:\Devel\Slicer-SuperBuild-Release\CTK-build\CTK-build\Libs\Core\CTKCore.vcxproj" (destinazione predefinita) (3) ->
12>    (destinazione: ClCompile) ->
12>C:\Devel\Slicer-SuperBuild-Release\CTK\Libs\Core\ctkBackTrace.cpp(173): warning C4267: 'argument' : conversion from 'size_t' to 'ULONG', possible loss of data [C:\Devel\Slicer-SuperBuild-Release\CTK-build\CTK-build\Libs\Core\CTKCore.vcxproj] [C:\Devel\Slicer-SuperBuild-Release\CTK-build\CTK.vcxproj]
12>    
12>    
12>    "C:\Devel\Slicer-SuperBuild-Release\CTK-build\CTK-build\ALL_BUILD.vcxproj" (destinazione predefinita) (1) ->
12>    "C:\Devel\Slicer-SuperBuild-Release\CTK-build\CTK-build\Libs\Widgets\CTKWidgetsPythonQt.vcxproj" (destinazione predefinita) (25) ->
12>    (destinazione: CustomBuild) ->
12>C:\Program Files (x86)\MSBuild\Microsoft.Cpp\v4.0\V120\Microsoft.CppCommon.targets(170,5): error MSB6006: "cmd.exe" terminato con il codice 1. [C:\Devel\Slicer-SuperBuild-Release\CTK-build\CTK-build\Libs\Widgets\CTKWidgetsPythonQt.vcxproj] [C:\Devel\Slicer-SuperBuild-Release\CTK-build\CTK.vcxproj]
12>    
12>        Avvisi: 1
12>        Errori: 1
12>    
12>    Tempo trascorso 00:07:41.71
12>  Compilazione progetto "C:\Devel\Slicer-SuperBuild-Release\CTK-build\CTK.vcxproj" (destinazioni predefinite) NON COMPLETATA.
12>  Compilazione progetto "C:\Devel\Slicer-SuperBuild-Release\CTK-build\ALL_BUILD.vcxproj" (destinazioni predefinite) NON COMPLETATA.
12>  
12>  Compilazione NON RIUSCITA.
12>  
12>  "C:\Devel\Slicer-SuperBuild-Release\CTK-build\ALL_BUILD.vcxproj" (destinazione predefinita) (1) ->
12>  "C:\Devel\Slicer-SuperBuild-Release\CTK-build\CTK.vcxproj" (destinazione predefinita) (3) ->
12>  "C:\Devel\Slicer-SuperBuild-Release\CTK-build\QtTesting.vcxproj" (destinazione predefinita) (7) ->
12>  (destinazione: CustomBuild) ->
12>C:\Devel\Slicer-SuperBuild-Release\CTK-build\QtTesting\pqEventDispatcher.cxx(331): warning C4996: 'getenv': This function or variable may be unsafe. Consider using _dupenv_s instead. To disable deprecation, use _CRT_SECURE_NO_WARNINGS. See online help for details. [C:\Devel\Slicer-SuperBuild-Release\CTK-build\QtTesting-build\QtTesting.vcxproj] [C:\Devel\Slicer-SuperBuild-Release\CTK-build\QtTesting.vcxproj]
12>C:\Devel\Slicer-SuperBuild-Release\CTK-build\QtTesting\pqEventDispatcher.cxx(331): warning C4996: 'getenv': This function or variable may be unsafe. Consider using _dupenv_s instead. To disable deprecation, use _CRT_SECURE_NO_WARNINGS. See online help for details. [C:\Devel\Slicer-SuperBuild-Release\CTK-build\QtTesting-build\QtTesting.vcxproj] [C:\Devel\Slicer-SuperBuild-Release\CTK-build\QtTesting.vcxproj]
12>  
12>  
12>  "C:\Devel\Slicer-SuperBuild-Release\CTK-build\ALL_BUILD.vcxproj" (destinazione predefinita) (1) ->
12>  "C:\Devel\Slicer-SuperBuild-Release\CTK-build\CTK.vcxproj" (destinazione predefinita) (3) ->
12>C:\Devel\Slicer-SuperBuild-Release\CTK\Libs\Core\ctkBackTrace.cpp(173): warning C4267: 'argument' : conversion from 'size_t' to 'ULONG', possible loss of data [C:\Devel\Slicer-SuperBuild-Release\CTK-build\CTK-build\Libs\Core\CTKCore.vcxproj] [C:\Devel\Slicer-SuperBuild-Release\CTK-build\CTK.vcxproj]
12>C:\Devel\Slicer-SuperBuild-Release\CTK\Libs\Core\ctkBackTrace.cpp(173): warning C4267: 'argument' : conversion from 'size_t' to 'ULONG', possible loss of data [C:\Devel\Slicer-SuperBuild-Release\CTK-build\CTK-build\Libs\Core\CTKCore.vcxproj] [C:\Devel\Slicer-SuperBuild-Release\CTK-build\CTK.vcxproj]
12>  
12>  
12>  "C:\Devel\Slicer-SuperBuild-Release\CTK-build\ALL_BUILD.vcxproj" (destinazione predefinita) (1) ->
12>  "C:\Devel\Slicer-SuperBuild-Release\CTK-build\CTK.vcxproj" (destinazione predefinita) (3) ->
12>  (destinazione: CustomBuild) ->
12>C:\Program Files (x86)\MSBuild\Microsoft.Cpp\v4.0\V120\Microsoft.CppCommon.targets(170,5): error MSB6006: "cmd.exe" terminato con il codice 1. [C:\Devel\Slicer-SuperBuild-Release\CTK-build\CTK-build\Libs\Widgets\CTKWidgetsPythonQt.vcxproj] [C:\Devel\Slicer-SuperBuild-Release\CTK-build\CTK.vcxproj]
12>C:\Program Files (x86)\MSBuild\Microsoft.Cpp\v4.0\V120\Microsoft.CppCommon.targets(170,5): error MSB6006: "cmd.exe" terminato con il codice 1. [C:\Devel\Slicer-SuperBuild-Release\CTK-build\CTK-build\Libs\Widgets\CTKWidgetsPythonQt.vcxproj] [C:\Devel\Slicer-SuperBuild-Release\CTK-build\CTK.vcxproj]
12>  
12>      Avvisi: 4
12>      Errori: 2
12>  
12>  Tempo trascorso 00:11:31.98
========== Build: 11 succeeded, 1 failed, 0 up-to-date, 0 skipped ==========















----- Messaggio originale -----
Da: "Simone Bnà" <[hidden email]>
A: "Andras Lasso" <[hidden email]>
Cc: "SPL Slicer Users" <[hidden email]>
Inviato: Venerdì, 30 settembre 2016 9:52:57
Oggetto: Re: [slicer-users] error in downloading pydicom

Thanks,

Simone.

----- Messaggio originale -----
Da: "Andras Lasso" <[hidden email]>
A: "Simone Bnà" <[hidden email]>, "SPL Slicer Users" <[hidden email]>
Inviato: Giovedì, 29 settembre 2016 23:11:17
Oggetto: RE: error in downloading pydicom

Google has retired its code repository and changed download URLs. Nightly Slicer builds use a different repository now:
https://pypi.python.org/packages/43/62/ba7218b51ebc231863c321dedef54cf97fb29e33832e67db00951a998c50/pydicom-0.9.8.tar.gz

Update your External_python-pydicom.cmake with the new URL.

Andras

-----Original Message-----
From: slicer-users [mailto:[hidden email]] On Behalf Of Simone Bnà
Sent: September 29, 2016 11:20
To: SPL Slicer Users <[hidden email]>
Subject: [slicer-users] error in downloading pydicom

Hi,

I am compiling the slicer framework
(tag 4.5.0.1,  ENH: Slicer 4.5.0-1 git-svn-id: http://svn.slicer.org/Slicer4/trunk@24735 3bd1e089-480b-0410-8dfb-8563597acbee)
with VS2013 and I found the following error:

35>  -- downloading...
35>         src='http://pydicom.googlecode.com/files/pydicom-0.9.8.tar.gz'
35>         dst='C:/Devel/Slicer-SuperBuild-Release/python-pydicom-prefix/src/pydicom-0.9.8.tar.gz'
35>         timeout='none'
35>CUSTOMBUILD : error : downloading 'http://pydicom.googlecode.com/files/pydicom-0.9.8.tar.gz' failed
35>    status_code: 22
35>    status_string: "HTTP response code said error"
35>    log:
35>    --- LOG BEGIN ---
35>    timeout on name lookup is not supported
35>    Trying 74.125.133.82...
35>  Connected to pydicom.googlecode.com (74.125.133.82) port 80 (#0)
35>  GET /files/pydicom-0.9.8.tar.gz HTTP/1.1
35>  
35>  Host: pydicom.googlecode.com
35>  
35>  User-Agent: curl/7.50.1
35>  
35>  Accept: */*
35>  
35>  
35>  
35>CUSTOMBUILD : The requested URL returned error : 404 Not Found
35>  Closing connection 0

which generates errors in cascade in other modules.

Is the URL of pydicom changed?

Thanks,

Best regards,

Simone.

--
Simone Bnà, PhD
C++ Software Developer, CINECA
Via Magnanelli 6/3, 40033 Casalecchio di Reno, Italy
office:   +39-0516171938
email: [hidden email]/[hidden email] _______________________________________________
slicer-users mailing list
[hidden email]
http://massmail.spl.harvard.edu/mailman/listinfo/slicer-users
To unsubscribe: send email to [hidden email] with unsubscribe as the subject http://www.slicer.org/slicerWiki/index.php/Documentation/4.3/FAQ

--
Simone Bnà, PhD
C++ Software Developer, CINECA
Via Magnanelli 6/3, 40033 Casalecchio di Reno, Italy
office:   +39-0516171938
email: [hidden email]/[hidden email]
_______________________________________________
slicer-users mailing list
[hidden email]
http://massmail.spl.harvard.edu/mailman/listinfo/slicer-users
To unsubscribe: send email to [hidden email] with unsubscribe as the subject
http://www.slicer.org/slicerWiki/index.php/Documentation/4.3/FAQ

--
Simone Bnà, PhD
C++ Software Developer, CINECA
Via Magnanelli 6/3, 40033 Casalecchio di Reno, Italy
office:   +39-0516171938
email: [hidden email]/[hidden email]
_______________________________________________
slicer-users mailing list
[hidden email]
http://massmail.spl.harvard.edu/mailman/listinfo/slicer-users
To unsubscribe: send email to [hidden email] with unsubscribe as the subject
http://www.slicer.org/slicerWiki/index.php/Documentation/4.3/FAQ
Reply | Threaded
Open this post in threaded view
|

Re: error in downloading pydicom

Andras Lasso-2
In reply to this post by Simone Bnà

The error is due to using too long directory names. Use for example c:\d\S4 and c:\d\S4R (you can add 1-2 more characters but not more).

 

If you have more questions about how to build Slicer, post them to the slicer-devel mailing list.

 

Andras

 

From: [hidden email]
Sent: Friday, September 30, 2016 5:15
To: [hidden email]
Cc: [hidden email]
Subject: Re: [slicer-users] error in downloading pydicom

 

Dear Andras,

I updated the URL and URL_MD5 of pydicom and it works ok.

Now, I have an error in the CTK build.

The error is :

IOError: [Errno 2] No such file or directory: 'C:/Devel/Slicer-SuperBuil-Release/CTK/Libs/Widgets/ctkMenuComboBoxEventPlayer.h'

Below you find the logs of the CTK build.

I tried to delete the build, re run cmake and re build with VS but I found the same error.

Do you have any idea?

Best,

Simone.


----------


12>         Creating library C:/Devel/Slicer-SuperBuild-Release/CTK-build/CTK-build/bin/Release/CTKWidgetsPlugins.lib and object C:/Devel/Slicer-SuperBuild-Release/CTK-build/CTK-build/bin/Release/CTKWidgetsPlugins.exp
12>      CTKWidgetsPlugins.vcxproj -> C:\Devel\Slicer-SuperBuild-Release\CTK-build\CTK-build\bin\designer\Release\CTKWidgetsPlugins.dll
12>    PostBuildEvent:
12>      setlocal
12>      "C:\Program Files\CMake\bin\cmake.exe" -E copy C:/Devel/Slicer-SuperBuild-Release/CTK-build/CTK-build/bin/designer/Release/CTKWidgetsPlugins.dll C:/Devel/Slicer-SuperBuild-Release/CTK-build/CTK-build/bin/designer/../designer/CTKWidgetsPlugins.dll
12>      if %errorlevel% neq 0 goto :cmEnd
12>      :cmEnd
12>      endlocal & call :cmErrorLevel %errorlevel% & goto :cmDone
12>      :cmErrorLevel
12>      exit /b %1
12>      :cmDone
12>      if %errorlevel% neq 0 goto :VCEnd
12>      :VCEnd
12>    FinalizeBuildStatus:
12>      Eliminazione del file "CTKWidgetsPlugins.dir\Release\CTKWidge.E9E1F3E7.tlog\unsuccessfulbuild" in corso.
12>      Aggiornamento timestamp di "CTKWidgetsPlugins.dir\Release\CTKWidge.E9E1F3E7.tlog\CTKWidgetsPlugins.lastbuildstate".
12>    Compilazione progetto "C:\Devel\Slicer-SuperBuild-Release\CTK-build\CTK-build\Libs\Widgets\Plugins\CTKWidgetsPlugins.vcxproj" (destinazioni predefinite) completata.
12>    Compilazione di "C:\Devel\Slicer-SuperBuild-Release\CTK-build\CTK-build\Libs\Widgets\CTKWidgetsPythonQt.vcxproj" (25) dal progetto "C:\Devel\Slicer-SuperBuild-Release\CTK-build\CTK-build\ALL_BUILD.vcxproj" (1) sul nodo 1 (destinazioni predefinite).
12>    PrepareForBuild:
12>      Creazione directory "CTKWidgetsPythonQt.dir\Release\".
12>      Creazione directory "CTKWidgetsPythonQt.dir\Release\CTKWidge.F219CE26.tlog\".
12>    InitializeBuildStatus:
12>      Creazione di "CTKWidgetsPythonQt.dir\Release\CTKWidge.F219CE26.tlog\unsuccessfulbuild". È stato specificato "AlwaysCreate".
12>    CustomBuild:
12>      Building Custom Rule C:/Devel/Slicer-SuperBuild-Release/CTK/Libs/Widgets/CMakeLists.txt
12>      CMake does not need to re-run because C:\Devel\Slicer-SuperBuild-Release\CTK-build\CTK-build\Libs\Widgets\CMakeFiles\generate.stamp is up-to-date.
12>      PythonQt Wrapping - Generating generated_cpp/org_commontk_CTKWidgets/org_commontk_CTKWidgets_init.cpp
12>      Traceback (most recent call last):
12>        File "C:/Devel/Slicer-SuperBuild-Release/CTK/CMake/ctkWrapPythonQt.py", line 237, in <module>
12>          ctk_wrap_pythonqt(options.target, options.namespace, options.output_dir, args, options.extra_verbose)
12>        File "C:/Devel/Slicer-SuperBuild-Release/CTK/CMake/ctkWrapPythonQt.py", line 77, in ctk_wrap_pythonqt
12>          with open(input_file) as f:
12>      IOError: [Errno 2] No such file or directory: 'C:/Devel/Slicer-SuperBuil-Release/CTK/Libs/Widgets/ctkMenuComboBoxEventPlayer.h'
12>C:\Program Files (x86)\MSBuild\Microsoft.Cpp\v4.0\V120\Microsoft.CppCommon.targets(170,5): error MSB6006: "cmd.exe" terminato con il codice 1. [C:\Devel\Slicer-SuperBuild-Release\CTK-build\CTK-build\Libs\Widgets\CTKWidgetsPythonQt.vcxproj] [C:\Devel\Slicer-SuperBuild-Release\CTK-build\CTK.vcxproj]
12>    Compilazione progetto "C:\Devel\Slicer-SuperBuild-Release\CTK-build\CTK-build\Libs\Widgets\CTKWidgetsPythonQt.vcxproj" (destinazioni predefinite) NON COMPLETATA.
12>    Compilazione di "C:\Devel\Slicer-SuperBuild-Release\CTK-build\CTK-build\Libs\Scripting\Python\Core\Python\CompileCTKScriptingPythonCorePythonFiles.vcxproj" (26) dal progetto "C:\Devel\Slicer-SuperBuild-Release\CTK-build\CTK-build\ALL_BUILD.vcxproj" (1) sul nodo 1 (destinazioni predefinite).
12>    Compilazione di "C:\Devel\Slicer-SuperBuild-Release\CTK-build\CTK-build\Libs\Scripting\Python\Core\Python\CopyCTKScriptingPythonCorePythonScriptFiles.vcxproj" (27) dal progetto "C:\Devel\Slicer-SuperBuild-Release\CTK-build\CTK-build\Libs\Scripting\Python\Core\Python\CompileCTKScriptingPythonCorePythonFiles.vcxproj" (26) sul nodo 1 (destinazioni predefinite).
12>    PrepareForBuild:
12>      Creazione directory "x64\Release\CopyCTKScriptingPythonCorePythonScriptFiles\".
12>      Creazione directory "x64\Release\CopyCTKScriptingPythonCorePythonScriptFiles\CopyCTKS.FFF3E6F9.tlog\".
12>    InitializeBuildStatus:
12>      Creazione di "x64\Release\CopyCTKScriptingPythonCorePythonScriptFiles\CopyCTKS.FFF3E6F9.tlog\unsuccessfulbuild". È stato specificato "AlwaysCreate".
12>    ComputeCustomBuildOutput:
12>      Creazione directory "C:\Devel\Slicer-SuperBuild-Release\CTK-build\CTK-build\bin\Python\qt\".
12>      Creazione directory "C:\Devel\Slicer-SuperBuild-Release\CTK-build\CTK-build\bin\Python\ctk\".
12>    CustomBuild:
12>      Building Custom Rule C:/Devel/Slicer-SuperBuild-Release/CTK/Libs/Scripting/Python/Core/Python/CMakeLists.txt
12>      CMake does not need to re-run because C:\Devel\Slicer-SuperBuild-Release\CTK-build\CTK-build\Libs\Scripting\Python\Core\Python\CMakeFiles\generate.stamp is up-to-date.
12>      Copying python Script: qt/__init__.py
12>      Copying python Script: ctk/__init__.py
12>    FinalizeBuildStatus:
12>      Eliminazione del file "x64\Release\CopyCTKScriptingPythonCorePythonScriptFiles\CopyCTKS.FFF3E6F9.tlog\unsuccessfulbuild" in corso.
12>      Aggiornamento timestamp di "x64\Release\CopyCTKScriptingPythonCorePythonScriptFiles\CopyCTKS.FFF3E6F9.tlog\CopyCTKScriptingPythonCorePythonScriptFiles.lastbuildstate".
12>    Compilazione progetto "C:\Devel\Slicer-SuperBuild-Release\CTK-build\CTK-build\Libs\Scripting\Python\Core\Python\CopyCTKScriptingPythonCorePythonScriptFiles.vcxproj" (destinazioni predefinite) completata.
12>    PrepareForBuild:
12>      Creazione directory "x64\Release\CompileCTKScriptingPythonCorePythonFiles\".
12>      Creazione directory "x64\Release\CompileCTKScriptingPythonCorePythonFiles\CompileC.4D90A2C9.tlog\".
12>    InitializeBuildStatus:
12>      Creazione di "x64\Release\CompileCTKScriptingPythonCorePythonFiles\CompileC.4D90A2C9.tlog\unsuccessfulbuild". È stato specificato "AlwaysCreate".
12>    CustomBuild:
12>      Building Custom Rule C:/Devel/Slicer-SuperBuild-Release/CTK/Libs/Scripting/Python/Core/Python/CMakeLists.txt
12>      CMake does not need to re-run because C:\Devel\Slicer-SuperBuild-Release\CTK-build\CTK-build\Libs\Scripting\Python\Core\Python\CMakeFiles\generate.stamp is up-to-date.
12>      Compiling python scripts: CTKScriptingPythonCore
12>      Compiling C:/Devel/Slicer-SuperBuild-Release/CTK-build/CTK-build/bin/Python/qt/__init__.py ...
12>     
12>      Compiling C:/Devel/Slicer-SuperBuild-Release/CTK-build/CTK-build/bin/Python/ctk/__init__.py ...
12>     
12>    FinalizeBuildStatus:
12>      Eliminazione del file "x64\Release\CompileCTKScriptingPythonCorePythonFiles\CompileC.4D90A2C9.tlog\unsuccessfulbuild" in corso.
12>      Aggiornamento timestamp di "x64\Release\CompileCTKScriptingPythonCorePythonFiles\CompileC.4D90A2C9.tlog\CompileCTKScriptingPythonCorePythonFiles.lastbuildstate".
12>    Compilazione progetto "C:\Devel\Slicer-SuperBuild-Release\CTK-build\CTK-build\Libs\Scripting\Python\Core\Python\CompileCTKScriptingPythonCorePythonFiles.vcxproj" (destinazioni predefinite) completata.
12>    Compilazione di "C:\Devel\Slicer-SuperBuild-Release\CTK-build\CTK-build\Applications\ctkDICOM\ctkDICOM.vcxproj" (28) dal progetto "C:\Devel\Slicer-SuperBuild-Release\CTK-build\CTK-build\ALL_BUILD.vcxproj" (1) sul nodo 1 (destinazioni predefinite).
12>    PrepareForBuild:
12>      Creazione directory "ctkDICOM.dir\Release\".
12>      Creazione directory "ctkDICOM.dir\Release\ctkDICOM.tlog\".
12>    InitializeBuildStatus:
12>      Creazione di "ctkDICOM.dir\Release\ctkDICOM.tlog\unsuccessfulbuild". È stato specificato "AlwaysCreate".
12>    CustomBuild:
12>      Building Custom Rule C:/Devel/Slicer-SuperBuild-Release/CTK/Applications/ctkDICOM/CMakeLists.txt
12>      CMake does not need to re-run because C:\Devel\Slicer-SuperBuild-Release\CTK-build\CTK-build\Applications\ctkDICOM\CMakeFiles\generate.stamp is up-to-date.
12>    MakeDirsForCl:
12>      Creazione directory "C:\Devel\Slicer-SuperBuild-Release\CTK-build\CTK-build\Applications\ctkDICOM\Release".
12>    ClCompile:
12>      C:\Program Files (x86)\Microsoft Visual Studio 12.0\VC\bin\x86_amd64\CL.exe /c /I"C:\D\Support\qt-4.8.7-64-vs2013-rel\include" /I"C:\D\Support\qt-4.8.7-64-vs2013-rel\include\QtOpenGL" /I"C:\D\Support\qt-4.8.7-64-vs2013-rel\include\QtXmlPatterns" /I"C:\D\Support\qt-4.8.7-64-vs2013-rel\include\QtGui" /I"C:\D\Support\qt-4.8.7-64-vs2013-rel\include\QtXml" /I"C:\D\Support\qt-4.8.7-64-vs2013-rel\include\QtSql" /I"C:\D\Support\qt-4.8.7-64-vs2013-rel\include\QtNetwork" /I"C:\D\Support\qt-4.8.7-64-vs2013-rel\include\QtCore" /I"C:\Devel\Slicer-SuperBuild-Release\CTK\Applications\ctkDICOM" /I"C:\Devel\Slicer-SuperBuild-Release\CTK-build\CTK-build\Applications\ctkDICOM" /I"C:\Devel\Slicer-SuperBuild-Release\CTK-build\CTK-build" /I"C:\Devel\Slicer-SuperBuild-Release\CTK\Libs\DICOM\Widgets" /I"C:\Devel\Slicer-SuperBuild-Release\CTK-build\CTK-build\Libs\DICOM\Widgets" /I"C:\Devel\Slicer-SuperBuild-Release\CTK\Libs\DICOM\Core" /I"C:\Devel\Slicer-SuperBuild-Release\CTK-build\CTK-build\Libs\DICOM\Core" /I"C:\Devel\Slicer-SuperBuild-Release\CTK\Libs\Widgets" /I"C:\Devel\Slicer-SuperBuild-Release\CTK-build\CTK-build\Libs\Widgets" /I"C:\Devel\Slicer-SuperBuild-Release\CTK\Libs\Core" /I"C:\Devel\Slicer-SuperBuild-Release\CTK-build\CTK-build\Libs\Core" /I"C:\Devel\Slicer-SuperBuild-Release\DCMTK-build\config\include\dcmtk\config" /I"C:\Devel\Slicer-SuperBuild-Release\DCMTK\ofstd\include\dcmtk\ofstd" /I"C:\Devel\Slicer-SuperBuild-Release\DCMTK\oflog\include\dcmtk\oflog" /I"C:\Devel\Slicer-SuperBuild-Release\DCMTK\dcmdata\include\dcmtk\dcmdata" /I"C:\Devel\Slicer-SuperBuild-Release\DCMTK\dcmimgle\include\dcmtk\dcmimgle" /I"C:\Devel\Slicer-SuperBuild-Release\DCMTK\dcmimage\include\dcmtk\dcmimage" /I"C:\Devel\Slicer-SuperBuild-Release\DCMTK\dcmjpeg\include\dcmtk\dcmjpeg" /I"C:\Devel\Slicer-SuperBuild-Release\DCMTK\dcmjpls\include\dcmtk\dcmjpls" /I"C:\Devel\Slicer-SuperBuild-Release\DCMTK\dcmtls\include\dcmtk\dcmtls" /I"C:\Devel\Slicer-SuperBuild-Release\DCMTK\dcmnet\include\dcmtk\dcmnet" /I"C:\Devel\Slicer-SuperBuild-Release\DCMTK\dcmsr\include\dcmtk\dcmsr" /I"C:\Devel\Slicer-SuperBuild-Release\DCMTK\dcmsign\include\dcmtk\dcmsign" /I"C:\Devel\Slicer-SuperBuild-Release\DCMTK\dcmwlm\include\dcmtk\dcmwlm" /I"C:\Devel\Slicer-SuperBuild-Release\DCMTK\dcmqrdb\include\dcmtk\dcmqrdb" /I"C:\Devel\Slicer-SuperBuild-Release\DCMTK\dcmpstat\include\dcmtk\dcmpstat" /I"C:\Devel\Slicer-SuperBuild-Release\DCMTK\dcmrt\include\dcmtk\dcmrt" /I"C:\Devel\Slicer-SuperBuild-Release\DCMTK\dcmiod\include\dcmtk\dcmiod" /I"C:\Devel\Slicer-SuperBuild-Release\DCMTK\dcmfg\include\dcmtk\dcmfg" /I"C:\Devel\Slicer-SuperBuild-Release\DCMTK\dcmseg\include\dcmtk\dcmseg" /I"C:\Devel\Slicer-SuperBuild-Release\DCMTK-build\config\include" /I"C:\Devel\Slicer-SuperBuild-Release\DCMTK\ofstd\include" /I"C:\Devel\Slicer-SuperBuild-Release\DCMTK\oflog\include" /I"C:\Devel\Slicer-SuperBuild-Release\DCMTK\dcmdata\include" /I"C:\Devel\Slicer-SuperBuild-Release\DCMTK\dcmimgle\include" /I"C:\Devel\Slicer-SuperBuild-Release\DCMTK\dcmimage\include" /I"C:\Devel\Slicer-SuperBuild-Release\DCMTK\dcmjpeg\include" /I"C:\Devel\Slicer-SuperBuild-Release\DCMTK\dcmjpls\include" /I"C:\Devel\Slicer-SuperBuild-Release\DCMTK\dcmtls\include" /I"C:\Devel\Slicer-SuperBuild-Release\DCMTK\dcmnet\include" /I"C:\Devel\Slicer-SuperBuild-Release\DCMTK\dcmsr\include" /I"C:\Devel\Slicer-SuperBuild-Release\DCMTK\dcmsign\include" /I"C:\Devel\Slicer-SuperBuild-Release\DCMTK\dcmwlm\include" /I"C:\Devel\Slicer-SuperBuild-Release\DCMTK\dcmqrdb\include" /I"C:\Devel\Slicer-SuperBuild-Release\DCMTK\dcmpstat\include" /I"C:\Devel\Slicer-SuperBuild-Release\DCMTK\dcmrt\include" /I"C:\Devel\Slicer-SuperBuild-Release\DCMTK\dcmiod\include" /I"C:\Devel\Slicer-SuperBuild-Release\DCMTK\dcmfg\include" /I"C:\Devel\Slicer-SuperBuild-Release\DCMTK\dcmseg\include" /nologo /W3 /WX- /O2 /Ob2 /D WIN32 /D _WINDOWS /D NOMINMAX /D NDEBUG /D QT_DLL /D QT_NO_DEBUG /D QT_OPENGL_LIB /D QT_XMLPATTERNS_LIB /D QT_GUI_LIB /D QT_XML_LIB /D QT_SQL_LIB /D QT_NETWORK_LIB /D QT_CORE_LIB /D PYTHONQT_USE_RELEASE_PYTHON_FALLBACK /D "CMAKE_INTDIR=\"Release\"" /D _MBCS /Gm- /EHsc /MD /GS /fp:precise /Zc:wchar_t /Zc:forScope /GR /Fo"ctkDICOM.dir\Release\\" /Fd"ctkDICOM.dir\Release\vc120.pdb" /Gd /TP /wd4290 /errorReport:queue "C:\Devel\Slicer-SuperBuild-Release\CTK\Applications\ctkDICOM\ctkDICOMMain.cpp"
12>      ctkDICOMMain.cpp
12>    Link:
12>      C:\Program Files (x86)\Microsoft Visual Studio 12.0\VC\bin\x86_amd64\link.exe /ERRORREPORT:QUEUE /OUT:"C:\Devel\Slicer-SuperBuild-Release\CTK-build\CTK-build\bin\Release\ctkDICOM.exe" /INCREMENTAL:NO /NOLOGO kernel32.lib user32.lib gdi32.lib winspool.lib shell32.lib ole32.lib oleaut32.lib uuid.lib comdlg32.lib advapi32.lib ..\..\bin\Release\CTKDICOMWidgets.lib ..\..\bin\Release\CTKDICOMCore.lib "C:\Devel\Slicer-SuperBuild-Release\DCMTK-build\lib\Release\i2d.lib" "C:\Devel\Slicer-SuperBuild-Release\DCMTK-build\lib\Release\dcmjpeg.lib" "C:\Devel\Slicer-SuperBuild-Release\DCMTK-build\lib\Release\ijg8.lib" "C:\Devel\Slicer-SuperBuild-Release\DCMTK-build\lib\Release\ijg12.lib" "C:\Devel\Slicer-SuperBuild-Release\DCMTK-build\lib\Release\ijg16.lib" "C:\Devel\Slicer-SuperBuild-Release\DCMTK-build\lib\Release\dcmjpls.lib" "C:\Devel\Slicer-SuperBuild-Release\DCMTK-build\lib\Release\charls.lib" "C:\Devel\Slicer-SuperBuild-Release\DCMTK-build\lib\Release\cmr.lib" "C:\Devel\Slicer-SuperBuild-Release\DCMTK-build\lib\Release\dcmwlm.lib" "C:\Devel\Slicer-SuperBuild-Release\DCMTK-build\lib\Release\dcmpstat.lib" "C:\Devel\Slicer-SuperBuild-Release\DCMTK-build\lib\Release\dcmtls.lib" "C:\Devel\Slicer-SuperBuild-Release\DCMTK-build\lib\Release\dcmsr.lib" "C:\Devel\Slicer-SuperBuild-Release\DCMTK-build\lib\Release\dcmimage.lib" "C:\Devel\Slicer-SuperBuild-Release\DCMTK-build\lib\Release\dcmdsig.lib" "C:\Devel\Slicer-SuperBuild-Release\DCMTK-build\lib\Release\dcmqrdb.lib" "C:\Devel\Slicer-SuperBuild-Release\DCMTK-build\lib\Release\dcmnet.lib" "C:\Devel\Slicer-SuperBuild-Release\DCMTK-build\lib\Release\dcmrt.lib" "C:\Devel\Slicer-SuperBuild-Release\DCMTK-build\lib\Release\dcmimgle.lib" "C:\Devel\Slicer-SuperBuild-Release\DCMTK-build\lib\Release\dcmseg.lib" "C:\Devel\Slicer-SuperBuild-Release\DCMTK-build\lib\Release\dcmfg.lib" "C:\Devel\Slicer-SuperBuild-Release\DCMTK-build\lib\Release\dcmiod.lib" "C:\Devel\Slicer-SuperBuild-Release\DCMTK-build\lib\Release\dcmdata.lib" "C:\Devel\Slicer-SuperBuild-Release\DCMTK-build\lib\Release\oflog.lib" "C:\Devel\Slicer-SuperBuild-Release\DCMTK-build\lib\Release\ofstd.lib" ws2_32.lib netapi32.lib wsock32.lib ..\..\bin\Release\CTKWidgets.lib ..\..\bin\Release\CTKCore.lib "C:\D\Support\qt-4.8.7-64-vs2013-rel\lib\QtOpenGL4.lib" "C:\D\Support\qt-4.8.7-64-vs2013-rel\lib\QtXmlPatterns4.lib" "C:\D\Support\qt-4.8.7-64-vs2013-rel\lib\QtXml4.lib" "C:\D\Support\qt-4.8.7-64-vs2013-rel\lib\QtSql4.lib" "C:\D\Support\qt-4.8.7-64-vs2013-rel\lib\QtNetwork4.lib" dbghelp.lib "C:\Devel\Slicer-SuperBuild-Release\CTK-build\QtTesting-build\Release\QtTesting.lib" "C:\D\Support\qt-4.8.7-64-vs2013-rel\lib\QtGui4.lib" "C:\D\Support\qt-4.8.7-64-vs2013-rel\lib\QtCore4.lib" /MANIFEST /MANIFESTUAC:"level='asInvoker' uiAccess='false'" /manifest:embed /PDB:"C:/Devel/Slicer-SuperBuild-Release/CTK-build/CTK-build/bin/Release/ctkDICOM.pdb" /SUBSYSTEM:CONSOLE /TLBID:1 /DYNAMICBASE /NXCOMPAT /IMPLIB:"C:/Devel/Slicer-SuperBuild-Release/CTK-build/CTK-build/bin/Release/ctkDICOM.lib" /MACHINE:X64  /machine:x64 ctkDICOM.dir\Release\ctkDICOMMain.obj
12>      ctkDICOM.vcxproj -> C:\Devel\Slicer-SuperBuild-Release\CTK-build\CTK-build\bin\Release\ctkDICOM.exe
12>    FinalizeBuildStatus:
12>      Eliminazione del file "ctkDICOM.dir\Release\ctkDICOM.tlog\unsuccessfulbuild" in corso.
12>      Aggiornamento timestamp di "ctkDICOM.dir\Release\ctkDICOM.tlog\ctkDICOM.lastbuildstate".
12>    Compilazione progetto "C:\Devel\Slicer-SuperBuild-Release\CTK-build\CTK-build\Applications\ctkDICOM\ctkDICOM.vcxproj" (destinazioni predefinite) completata.
12>    Compilazione progetto "C:\Devel\Slicer-SuperBuild-Release\CTK-build\CTK-build\ALL_BUILD.vcxproj" (destinazioni predefinite) NON COMPLETATA.
12>   
12>    Compilazione NON RIUSCITA.
12>   
12>    "C:\Devel\Slicer-SuperBuild-Release\CTK-build\CTK-build\ALL_BUILD.vcxproj" (destinazione predefinita) (1) ->
12>    "C:\Devel\Slicer-SuperBuild-Release\CTK-build\CTK-build\Libs\Core\CTKCore.vcxproj" (destinazione predefinita) (3) ->
12>    (destinazione: ClCompile) ->
12>C:\Devel\Slicer-SuperBuild-Release\CTK\Libs\Core\ctkBackTrace.cpp(173): warning C4267: 'argument' : conversion from 'size_t' to 'ULONG', possible loss of data [C:\Devel\Slicer-SuperBuild-Release\CTK-build\CTK-build\Libs\Core\CTKCore.vcxproj] [C:\Devel\Slicer-SuperBuild-Release\CTK-build\CTK.vcxproj]
12>   
12>   
12>    "C:\Devel\Slicer-SuperBuild-Release\CTK-build\CTK-build\ALL_BUILD.vcxproj" (destinazione predefinita) (1) ->
12>    "C:\Devel\Slicer-SuperBuild-Release\CTK-build\CTK-build\Libs\Widgets\CTKWidgetsPythonQt.vcxproj" (destinazione predefinita) (25) ->
12>    (destinazione: CustomBuild) ->
12>C:\Program Files (x86)\MSBuild\Microsoft.Cpp\v4.0\V120\Microsoft.CppCommon.targets(170,5): error MSB6006: "cmd.exe" terminato con il codice 1. [C:\Devel\Slicer-SuperBuild-Release\CTK-build\CTK-build\Libs\Widgets\CTKWidgetsPythonQt.vcxproj] [C:\Devel\Slicer-SuperBuild-Release\CTK-build\CTK.vcxproj]
12>   
12>        Avvisi: 1
12>        Errori: 1
12>   
12>    Tempo trascorso 00:07:41.71
12>  Compilazione progetto "C:\Devel\Slicer-SuperBuild-Release\CTK-build\CTK.vcxproj" (destinazioni predefinite) NON COMPLETATA.
12>  Compilazione progetto "C:\Devel\Slicer-SuperBuild-Release\CTK-build\ALL_BUILD.vcxproj" (destinazioni predefinite) NON COMPLETATA.
12> 
12>  Compilazione NON RIUSCITA.
12> 
12>  "C:\Devel\Slicer-SuperBuild-Release\CTK-build\ALL_BUILD.vcxproj" (destinazione predefinita) (1) ->
12>  "C:\Devel\Slicer-SuperBuild-Release\CTK-build\CTK.vcxproj" (destinazione predefinita) (3) ->
12>  "C:\Devel\Slicer-SuperBuild-Release\CTK-build\QtTesting.vcxproj" (destinazione predefinita) (7) ->
12>  (destinazione: CustomBuild) ->
12>C:\Devel\Slicer-SuperBuild-Release\CTK-build\QtTesting\pqEventDispatcher.cxx(331): warning C4996: 'getenv': This function or variable may be unsafe. Consider using _dupenv_s instead. To disable deprecation, use _CRT_SECURE_NO_WARNINGS. See online help for details. [C:\Devel\Slicer-SuperBuild-Release\CTK-build\QtTesting-build\QtTesting.vcxproj] [C:\Devel\Slicer-SuperBuild-Release\CTK-build\QtTesting.vcxproj]
12>C:\Devel\Slicer-SuperBuild-Release\CTK-build\QtTesting\pqEventDispatcher.cxx(331): warning C4996: 'getenv': This function or variable may be unsafe. Consider using _dupenv_s instead. To disable deprecation, use _CRT_SECURE_NO_WARNINGS. See online help for details. [C:\Devel\Slicer-SuperBuild-Release\CTK-build\QtTesting-build\QtTesting.vcxproj] [C:\Devel\Slicer-SuperBuild-Release\CTK-build\QtTesting.vcxproj]
12> 
12> 
12>  "C:\Devel\Slicer-SuperBuild-Release\CTK-build\ALL_BUILD.vcxproj" (destinazione predefinita) (1) ->
12>  "C:\Devel\Slicer-SuperBuild-Release\CTK-build\CTK.vcxproj" (destinazione predefinita) (3) ->
12>C:\Devel\Slicer-SuperBuild-Release\CTK\Libs\Core\ctkBackTrace.cpp(173): warning C4267: 'argument' : conversion from 'size_t' to 'ULONG', possible loss of data [C:\Devel\Slicer-SuperBuild-Release\CTK-build\CTK-build\Libs\Core\CTKCore.vcxproj] [C:\Devel\Slicer-SuperBuild-Release\CTK-build\CTK.vcxproj]
12>C:\Devel\Slicer-SuperBuild-Release\CTK\Libs\Core\ctkBackTrace.cpp(173): warning C4267: 'argument' : conversion from 'size_t' to 'ULONG', possible loss of data [C:\Devel\Slicer-SuperBuild-Release\CTK-build\CTK-build\Libs\Core\CTKCore.vcxproj] [C:\Devel\Slicer-SuperBuild-Release\CTK-build\CTK.vcxproj]
12> 
12> 
12>  "C:\Devel\Slicer-SuperBuild-Release\CTK-build\ALL_BUILD.vcxproj" (destinazione predefinita) (1) ->
12>  "C:\Devel\Slicer-SuperBuild-Release\CTK-build\CTK.vcxproj" (destinazione predefinita) (3) ->
12>  (destinazione: CustomBuild) ->
12>C:\Program Files (x86)\MSBuild\Microsoft.Cpp\v4.0\V120\Microsoft.CppCommon.targets(170,5): error MSB6006: "cmd.exe" terminato con il codice 1. [C:\Devel\Slicer-SuperBuild-Release\CTK-build\CTK-build\Libs\Widgets\CTKWidgetsPythonQt.vcxproj] [C:\Devel\Slicer-SuperBuild-Release\CTK-build\CTK.vcxproj]
12>C:\Program Files (x86)\MSBuild\Microsoft.Cpp\v4.0\V120\Microsoft.CppCommon.targets(170,5): error MSB6006: "cmd.exe" terminato con il codice 1. [C:\Devel\Slicer-SuperBuild-Release\CTK-build\CTK-build\Libs\Widgets\CTKWidgetsPythonQt.vcxproj] [C:\Devel\Slicer-SuperBuild-Release\CTK-build\CTK.vcxproj]
12> 
12>      Avvisi: 4
12>      Errori: 2
12> 
12>  Tempo trascorso 00:11:31.98
========== Build: 11 succeeded, 1 failed, 0 up-to-date, 0 skipped ==========















----- Messaggio originale -----
Da: "Simone Bnà" <[hidden email]>
A: "Andras Lasso" <[hidden email]>
Cc: "SPL Slicer Users" <[hidden email]>
Inviato: Venerdì, 30 settembre 2016 9:52:57
Oggetto: Re: [slicer-users] error in downloading pydicom

Thanks,

Simone.

----- Messaggio originale -----
Da: "Andras Lasso" <[hidden email]>
A: "Simone Bnà" <[hidden email]>, "SPL Slicer Users" <[hidden email]>
Inviato: Giovedì, 29 settembre 2016 23:11:17
Oggetto: RE: error in downloading pydicom

Google has retired its code repository and changed download URLs. Nightly Slicer builds use a different repository now:
https://pypi.python.org/packages/43/62/ba7218b51ebc231863c321dedef54cf97fb29e33832e67db00951a998c50/pydicom-0.9.8.tar.gz

Update your External_python-pydicom.cmake with the new URL.

Andras

-----Original Message-----
From: slicer-users [[hidden email]] On Behalf Of Simone Bnà
Sent: September 29, 2016 11:20
To: SPL Slicer Users <[hidden email]>
Subject: [slicer-users] error in downloading pydicom

Hi,

I am compiling the slicer framework
(tag 4.5.0.1,  ENH: Slicer 4.5.0-1 git-svn-id: http://svn.slicer.org/Slicer4/trunk@24735 3bd1e089-480b-0410-8dfb-8563597acbee)
with VS2013 and I found the following error:

35>  -- downloading...
35>         src='http://pydicom.googlecode.com/files/pydicom-0.9.8.tar.gz'
35>         dst='C:/Devel/Slicer-SuperBuild-Release/python-pydicom-prefix/src/pydicom-0.9.8.tar.gz'
35>         timeout='none'
35>CUSTOMBUILD : error : downloading 'http://pydicom.googlecode.com/files/pydicom-0.9.8.tar.gz' failed
35>    status_code: 22
35>    status_string: "HTTP response code said error"
35>    log:
35>    --- LOG BEGIN ---
35>    timeout on name lookup is not supported
35>    Trying 74.125.133.82...
35>  Connected to pydicom.googlecode.com (74.125.133.82) port 80 (#0)
35>  GET /files/pydicom-0.9.8.tar.gz HTTP/1.1
35> 
35>  Host: pydicom.googlecode.com
35> 
35>  User-Agent: curl/7.50.1
35> 
35>  Accept: */*
35> 
35> 
35> 
35>CUSTOMBUILD : The requested URL returned error : 404 Not Found
35>  Closing connection 0

which generates errors in cascade in other modules.

Is the URL of pydicom changed?

Thanks,

Best regards,

Simone.

--
Simone Bnà, PhD
C++ Software Developer, CINECA
Via Magnanelli 6/3, 40033 Casalecchio di Reno, Italy
office:   +39-0516171938
email: [hidden email]/[hidden email] _______________________________________________
slicer-users mailing list
[hidden email]
http://massmail.spl.harvard.edu/mailman/listinfo/slicer-users
To unsubscribe: send email to [hidden email] with unsubscribe as the subject http://www.slicer.org/slicerWiki/index.php/Documentation/4.3/FAQ

--
Simone Bnà, PhD
C++ Software Developer, CINECA
Via Magnanelli 6/3, 40033 Casalecchio di Reno, Italy
office:   +39-0516171938
email: [hidden email]/[hidden email]
_______________________________________________
slicer-users mailing list
[hidden email]
http://massmail.spl.harvard.edu/mailman/listinfo/slicer-users
To unsubscribe: send email to [hidden email] with unsubscribe as the subject
http://www.slicer.org/slicerWiki/index.php/Documentation/4.3/FAQ

--
Simone Bnà, PhD
C++ Software Developer, CINECA
Via Magnanelli 6/3, 40033 Casalecchio di Reno, Italy
office:   +39-0516171938
email: [hidden email]/[hidden email]

_______________________________________________
slicer-users mailing list
[hidden email]
http://massmail.spl.harvard.edu/mailman/listinfo/slicer-users
To unsubscribe: send email to [hidden email] with unsubscribe as the subject
http://www.slicer.org/slicerWiki/index.php/Documentation/4.3/FAQ